Target
Peroxisome proliferator-activated receptor alpha
Ligand
BDBM24566
Substrate
Meas. Tech.
ChEMBL_1779822 (CHEMBL4236814)
EC50
1560±n/a nM
Citation
 Laghezza, APiemontese, LCerchia, CMontanari, RCapelli, DGiudici, MCrestani, MTortorella, PPeiretti, FPochetti, GLavecchia, ALoiodice, F Identification of the First PPAR?/? Dual Agonist Able To Bind to Canonical and Alternative Sites of PPAR? and To Inhibit Its Cdk5-Mediated Phosphorylation. J Med Chem 61:8282-8298 (2018)  
Target
Name:
Peroxisome proliferator-activated receptor alpha
Synonyms:
NR1C1 PPAR PPAR-alpha PPARA_HUMAN Peroxisome proliferator-activated receptor | Peroxisome proliferator-activated receptor alpha (PPAR alpha)
Type:
Enzyme
Mol. Mass.:
52222.08
Organism:
Homo sapiens (Human)
Description:
Q07869
Residue:
468
  
Inhibitor
Name:
BDBM24566
Synonyms:
2-({4-chloro-6-[(2,3-dimethylphenyl)amino]pyrimidin-2-yl}sulfanyl)acetic acid JMC515449 Compound 1 Wyeth 14,643
Type:
Small organic molecule
Emp. Form.:
C14H14ClN3O2S
Mol. Mass.:
323.798
SMILES:
Cc1cccc(Nc2cc(Cl)nc(SCC(O)=O)n2)c1C
: