Target
ATPase family AAA domain-containing protein 2
Ligand
BDBM50098300
Substrate
Meas. Tech.
ChEMBL_1780007 (CHEMBL4236999)
IC50
316±n/a nM
Citation
 Bamborough, PChung, CWFurze, RCGrandi, PMichon, AMWatson, RJMitchell, DJBarnett, HPrinjha, RKRau, CSheppard, RJWerner, TDemont, EH Aiming to Miss a Moving Target: Bromo and Extra Terminal Domain (BET) Selectivity in Constrained ATAD2 Inhibitors. J Med Chem 61:8321-8336 (2018)  
Target
Name:
ATPase family AAA domain-containing protein 2
Synonyms:
AAA nuclear coregulator cancer-associated protein ATAD2 PRO2000
Type:
PROTEIN
Mol. Mass.:
158546.30
Organism:
Homo sapiens (Human)
Description:
ChEMBL_1500426
Residue:
1390
  
Inhibitor
Name:
BDBM50098300
Synonyms:
CHEMBL3590382
Type:
Small organic molecule
Emp. Form.:
C26H33N5O3
Mol. Mass.:
463.5719
SMILES:
Cc1cncc(c1)-c1cnc(N[C@@H]2CCNC[C@H]2OCC2CCOCC2)c2[nH]c(=O)c(C)cc12
: