Target
Aurora kinase B/Inner centromere protein
Ligand
BDBM50341532
Substrate
Meas. Tech.
ChEMBL_1785126 (CHEMBL4256643)
Ki
41000±n/a nM
Citation
 Fearon, DWestwood, IMvan Montfort, RLMBayliss, RJones, KBavetsias, V Synthesis and profiling of a 3-aminopyridin-2-one-based kinase targeted fragment library: Identification of 3-amino-5-(pyridin-4-yl)pyridin-2(1H)-one scaffold for monopolar spindle 1 (MPS1) and Aurora kinases inhibition. Bioorg Med Chem 26:3021-3029 (2018)  
Target
Name:
Aurora kinase B/Inner centromere protein
Synonyms:
Aurora B/Incenp
Type:
Protein Complex
Mol. Mass.:
Description:
Components:
This complex has 2 components.
Component 1
Name:
Aurora kinase B
Synonyms:
AIK2 AIM1 ARK2 AURKB_HUMAN Aurora B-INCENP Aurora kinase B (AURKB) STK-1 STK12 Serine/threonine-protein kinase aurora B
Type:
Protein
Mol. Mass.:
39327.72
Organism:
Homo sapiens (Human)
Description:
Q96GD4
Residue:
344
  
Component 2
Name:
Inner centromere protein
Synonyms:
INCENP | INCE_HUMAN
Type:
Protein
Mol. Mass.:
105461.33
Organism:
Homo sapiens (Human)
Description:
Q9NQS7
Residue:
918
  
Inhibitor
Name:
BDBM50341532
Synonyms:
3-Benzoylamino-5-(pyridin-4-yl)-(1H)-pyridin-2-one N-(6-oxo-1,6-dihydro-3,4'-bipyridin-5-yl)benzamide
Type:
Small organic molecule
Emp. Form.:
C17H13N3O2
Mol. Mass.:
291.304
SMILES:
O=C(Nc1cc(c[nH]c1=O)-c1ccncc1)c1ccccc1
: