Target
Transcriptional activator protein LasR
Ligand
BDBM50465697
Substrate
Meas. Tech.
ChEMBL_1788567 (CHEMBL4260301)
IC50
5200±n/a nM
Citation
 Soukarieh, FWilliams, PStocks, MJCámara, M Pseudomonas aeruginosa Quorum Sensing Systems as Drug Discovery Targets: Current Position and Future Perspectives. J Med Chem 61:10385-10402 (2018)  
Target
Name:
Transcriptional activator protein LasR
Synonyms:
LASR_PSEAE | lasR
Type:
PROTEIN
Mol. Mass.:
26618.24
Organism:
Pseudomonas aeruginosa
Description:
ChEMBL_1475312
Residue:
239
  
Inhibitor
Name:
BDBM50465697
Synonyms:
CHEMBL4289544
Type:
Small organic molecule
Emp. Form.:
C13H14ClNO3S
Mol. Mass.:
299.773
SMILES:
Clc1ccc(SCCC(=O)N[C@H]2CCOC2=O)cc1
: