Target
Transcriptional activator protein LasR
Ligand
BDBM50241431
Substrate
Meas. Tech.
ChEMBL_1788569 (CHEMBL4260303)
IC50
610±n/a nM
Citation
 Soukarieh, FWilliams, PStocks, MJCámara, M Pseudomonas aeruginosa Quorum Sensing Systems as Drug Discovery Targets: Current Position and Future Perspectives. J Med Chem 61:10385-10402 (2018)  
Target
Name:
Transcriptional activator protein LasR
Synonyms:
LASR_PSEAE | lasR
Type:
PROTEIN
Mol. Mass.:
26618.24
Organism:
Pseudomonas aeruginosa
Description:
ChEMBL_1475312
Residue:
239
  
Inhibitor
Name:
BDBM50241431
Synonyms:
(S)-2-(3-nitrophenyl)-N-(2-oxo-tetrahydrofuran-3-yl)acetamide CHEMBL405298
Type:
Small organic molecule
Emp. Form.:
C12H12N2O5
Mol. Mass.:
264.2341
SMILES:
[O-][N+](=O)c1cccc(CC(=O)N[C@H]2CCOC2=O)c1
: