Target
D(1A) dopamine receptor
Ligand
BDBM50465943
Substrate
Meas. Tech.
ChEMBL_1789226 (CHEMBL4260960)
Ki
56±n/a nM
Citation
 Davoren, JENason, DCoe, JDlugolenski, KHelal, CHarris, ARLaChapelle, ELiang, SLiu, YO'Connor, ROrozco, CCRai, BKSalafia, MSamas, BXu, WKozak, RGray, D Discovery and Lead Optimization of Atropisomer D1 Agonists with Reduced Desensitization. J Med Chem 61:11384-11397 (2018)  
Target
Name:
D(1A) dopamine receptor
Synonyms:
DA D1 receptor DRD1 Dopamine D1 receptor Dopamine D1A
Type:
Enzyme
Mol. Mass.:
49303.43
Organism:
Homo sapiens (Human)
Description:
P21728
Residue:
446
  
Inhibitor
Name:
BDBM50465943
Synonyms:
CHEMBL4286110
Type:
Small organic molecule
Emp. Form.:
C23H16N2O3
Mol. Mass.:
368.3847
SMILES:
COc1ccc2cnccc2c1-c1ccc(Oc2nccc3occc23)cc1
: