Target
Polyunsaturated fatty acid 5-lipoxygenase
Ligand
BDBM50025307
Substrate
Meas. Tech.
ChEBML_3907
IC50
17±n/a nM
Citation
 Horie, TTsukayama, MKourai, HYokoyama, CFurukawa, MYoshimoto, TYamamoto, SWatanabe-Kohno, SOhata, K Syntheses of 5,6,7- and 5,7,8-trioxygenated 3',4'-dihydroxyflavones having alkoxy groups and their inhibitory activities against arachidonate 5-lipoxygenase. J Med Chem 29:2256-62 (1986)  
Target
Name:
Polyunsaturated fatty acid 5-lipoxygenase
Synonyms:
Alox5 LOX5_RAT
Type:
PROTEIN
Mol. Mass.:
78082.31
Organism:
Rattus norvegicus
Description:
ChEMBL_1432947
Residue:
673
  
Inhibitor
Name:
BDBM50025307
Synonyms:
6-Decyloxy-2-(3,4-dihydroxy-phenyl)-5,7-dimethoxy-chromen-4-one | CHEMBL308070
Type:
Small organic molecule
Emp. Form.:
C27H34O7
Mol. Mass.:
470.5547
SMILES:
CCCCCCCCCCOc1c(OC)cc2oc(cc(=O)c2c1OC)-c1ccc(O)c(O)c1
: