Target
Polyunsaturated fatty acid 5-lipoxygenase
Ligand
BDBM50025315
Substrate
Meas. Tech.
ChEBML_3907
IC50
11±n/a nM
Citation
 Horie, TTsukayama, MKourai, HYokoyama, CFurukawa, MYoshimoto, TYamamoto, SWatanabe-Kohno, SOhata, K Syntheses of 5,6,7- and 5,7,8-trioxygenated 3',4'-dihydroxyflavones having alkoxy groups and their inhibitory activities against arachidonate 5-lipoxygenase. J Med Chem 29:2256-62 (1986)  
Target
Name:
Polyunsaturated fatty acid 5-lipoxygenase
Synonyms:
Alox5 LOX5_RAT
Type:
PROTEIN
Mol. Mass.:
78082.31
Organism:
Rattus norvegicus
Description:
ChEMBL_1432947
Residue:
673
  
Inhibitor
Name:
BDBM50025315
Synonyms:
2-(3,4-Dihydroxy-phenyl)-5-hydroxy-7-methoxy-6-octyloxy-chromen-4-one | CHEMBL73186
Type:
Small organic molecule
Emp. Form.:
C24H28O7
Mol. Mass.:
428.4749
SMILES:
CCCCCCCCOc1c(OC)cc2oc(cc(=O)c2c1O)-c1ccc(O)c(O)c1
: