Target
Poly-beta-1,6-N-acetyl-D-glucosamine N-deacetylase
Ligand
BDBM50466410
Substrate
Meas. Tech.
ChEMBL_1793117 (CHEMBL4265036)
IC50
>8000000±n/a nM
Citation
 DiFrancesco, BRMorrison, ZANitz, M Monosaccharide inhibitors targeting carbohydrate esterase family 4 de-N-acetylases. Bioorg Med Chem 26:5631-5643 (2018)  
Target
Name:
Poly-beta-1,6-N-acetyl-D-glucosamine N-deacetylase
Synonyms:
PGAB_ECOLI pgaB | ycdR
Type:
Protein
Mol. Mass.:
77407.78
Organism:
Escherichia coli (Enterobacteria)
Description:
P75906
Residue:
672
  
Inhibitor
Name:
BDBM50466410
Synonyms:
CHEMBL4294745
Type:
Small organic molecule
Emp. Form.:
C15H21NO5S
Mol. Mass.:
327.396
SMILES:
CC(=O)N[C@@H]1[C@@H](S)[C@H](O)[C@@H](CO)O[C@H]1OCc1ccccc1
: