Target
Retinal dehydrogenase 2
Ligand
BDBM50466622
Substrate
Meas. Tech.
ChEMBL_1793482 (CHEMBL4265401)
Ki
128±n/a nM
Citation
 Harper, ARLe, ATMather, TBurgett, ABerry, WSummers, JA Design, synthesis, and ex vivo evaluation of a selective inhibitor for retinaldehyde dehydrogenase enzymes. Bioorg Med Chem 26:5766-5779 (2018)  
Target
Name:
Retinal dehydrogenase 2
Synonyms:
1.2.1.36 ALDH1A2 RALDH 2 RALDH2 Retinaldehyde-specific dehydrogenase type 2
Type:
PROTEIN
Mol. Mass.:
56729.31
Organism:
Gallus gallus
Description:
ChEMBL_117928
Residue:
518
  
Inhibitor
Name:
BDBM50466622
Synonyms:
CHEMBL4286209
Type:
Small organic molecule
Emp. Form.:
C21H28Cl2O
Mol. Mass.:
367.352
SMILES:
C\C(\C=C\C1=C(C)CCCC1(C)C)=C/C=C/C(/C)=C/C(=O)C(Cl)Cl
: