Target
ALK tyrosine kinase receptor
Ligand
BDBM50466801
Substrate
Meas. Tech.
ChEMBL_1794140 (CHEMBL4266257)
Ki
0.290000±n/a nM
Citation
 Basit, SAshraf, ZLee, KLatif, M First macrocyclic 3 Eur J Med Chem 134:348-356 (2017)  
Target
Name:
ALK tyrosine kinase receptor
Synonyms:
ALK ALK_HUMAN CD_antigen: CD246
Type:
Protein
Mol. Mass.:
176453.10
Organism:
Homo sapiens (Human)
Description:
Q9UM73
Residue:
1620
  
Inhibitor
Name:
BDBM50466801
Synonyms:
CHEMBL4286522
Type:
Small organic molecule
Emp. Form.:
C21H23FN5O2
Mol. Mass.:
396.4375
SMILES:
C[C@H]1Oc2cc(cnc2N)-c2c(C)[nH][n+](C)c2CN(C)C(=O)c2ccc(F)cc12
: