Target
Adenosine receptor A1
Ligand
BDBM50025678
Substrate
Meas. Tech.
ChEBML_29624
Ki
0.870000±n/a nM
Citation
 Jacobson, KAUkena, DPadgett, WDaly, JWKirk, KL Xanthine functionalized congeners as potent ligands at A2-adenosine receptors. J Med Chem 30:211-4 (1987)  
Target
Name:
Adenosine receptor A1
Synonyms:
AA1R_RAT ADENOSINE A1 high Adenosine A1 receptor (A1) Adenosine receptors A1 | Adora1
Type:
Protein
Mol. Mass.:
36704.13
Organism:
Rattus norvegicus (rat)
Description:
Residue:
326
  
Inhibitor
Name:
BDBM50025678
Synonyms:
2,6-Diamino-hexanoic acid (2-{2-[4-(2,6-dioxo-1,3-dipropyl-2,3,6,7-tetrahydro-1H-purin-8-yl)-phenoxy]-acetylamino}-ethyl)-amide | CHEMBL70059
Type:
Small organic molecule
Emp. Form.:
C27H40N8O5
Mol. Mass.:
556.6571
SMILES:
CCCn1c2nc([nH]c2c(=O)n(CCC)c1=O)-c1ccc(OCC(=O)NCCNC(=O)[C@@H](N)CCCCN)cc1
: