Target
Nuclear receptor ROR-beta
Ligand
BDBM50466991
Substrate
Meas. Tech.
ChEMBL_1794704 (CHEMBL4266821)
IC50
40±n/a nM
Citation
 Doebelin, CPatouret, RGarcia-Ordonez, RDChang, MRDharmarajan, VNovick, SCiesla, ACampbell, SSolt, LAGriffin, PRKamenecka, TM Identification of potent ROR? modulators: Scaffold variation. Bioorg Med Chem Lett 28:3210-3215 (2018)  
Target
Name:
Nuclear receptor ROR-beta
Synonyms:
NR1F2 Nuclear receptor subfamily 1 group F member 2 RORB_HUMAN Retinoid-related orphan receptor-beta
Type:
PROTEIN
Mol. Mass.:
53227.30
Organism:
Homo sapiens (Human)
Description:
ChEMBL_107979
Residue:
470
  
Inhibitor
Name:
BDBM50466991
Synonyms:
CHEMBL4276720
Type:
Small organic molecule
Emp. Form.:
C18H11ClF3NOS
Mol. Mass.:
381.799
SMILES:
Nc1cc(c(s1)C(=O)c1ccccc1Cl)-c1cccc(c1)C(F)(F)F
: