Target
Adenosine receptor A1
Ligand
BDBM50025708
Substrate
Meas. Tech.
ChEMBL_28997 (CHEMBL643472)
Ki
370±n/a nM
Citation
 Hamilton, HWOrtwine, DFWorth, DFBristol, JA Synthesis and structure-activity relationships of pyrazolo[4,3-d]pyrimidin-7-ones as adenosine receptor antagonists. J Med Chem 30:91-6 (1987)  
Target
Name:
Adenosine receptor A1
Synonyms:
AA1R_RAT ADENOSINE A1 high Adenosine A1 receptor (A1) Adenosine receptors A1 | Adora1
Type:
Protein
Mol. Mass.:
36704.13
Organism:
Rattus norvegicus (rat)
Description:
Residue:
326
  
Inhibitor
Name:
BDBM50025708
Synonyms:
2-[6-(1-Carbamoyl-ethylsulfanyl)-1-phenyl-1H-pyrazolo[3,4-d]pyrimidin-4-ylsulfanyl]-propionamide | CHEMBL78636
Type:
Small organic molecule
Emp. Form.:
C17H18N6O2S2
Mol. Mass.:
402.494
SMILES:
CC(Sc1nc(SC(C)C(N)=O)c2cnn(-c3ccccc3)c2n1)C(N)=O
: