Target
Chymotrypsin-like elastase family member 1/2A
Ligand
BDBM50225471
Substrate
Meas. Tech.
ChEMBL_152334 (CHEMBL758716)
Ki
1220000±n/a nM
Citation
 Groutas, WCAbrams, WRTheodorakis, MCKasper, AMRude, SABadger, RCOcain, TDMiller, KEMoi, MKBrubaker, MJ Amino acid derived latent isocyanates: irreversible inactivation of porcine pancreatic elastase and human leukocyte elastase. J Med Chem 28:204-9 (1985)  
Target
Name:
Chymotrypsin-like elastase family member 1/2A
Synonyms:
Pancreatic elastase
Type:
Mol. Mass.:
Description:
ASSAY_ID of ChEMBL is 152345
Components:
This complex has 2 components.
Component 1
Name:
Chymotrypsin-like elastase family member 1
Synonyms:
CELA1 ELA1 Elastase 1 Pancreatic elastase
Type:
Enzyme
Mol. Mass.:
28827.71
Organism:
Sus scrofa (Pig)
Description:
P00772
Residue:
266
  
Component 2
Name:
Chymotrypsin-like elastase family member 2A
Synonyms:
CEL2A_PIG ELA2 Elastase 2A Elastase-2A | Pancreatic elastase
Type:
PROTEIN
Mol. Mass.:
28705.23
Organism:
Sus scrofa
Description:
ChEMBL_156951
Residue:
269
  
Inhibitor
Name:
BDBM50225471
Synonyms:
CHEMBL63295
Type:
Small organic molecule
Emp. Form.:
C11H17N3O3
Mol. Mass.:
239.271
SMILES:
[H][C@](NC(=O)n1ccnc1)(C(C)CC)C(=O)OC
: