Target
Renin
Ligand
BDBM50025935
Substrate
Meas. Tech.
ChEMBL_196261 (CHEMBL803238)
Ki
0.026000±n/a nM
Citation
 Evans, BERittle, KEBock, MGBennett, CDDiPardo, RMBoger, JPoe, MUlm, EHLaMont, BIBlaine, EH A uniquely potent renin inhibitor and its unanticipated plasma binding component. J Med Chem 28:1755-6 (1986)  
Target
Name:
Renin
Synonyms:
Angiotensinogenase RENI_HUMAN
Type:
Enzyme
Mol. Mass.:
45058.99
Organism:
Homo sapiens (Human)
Description:
Residue:
406
  
Inhibitor
Name:
BDBM50025935
Synonyms:
CHEMBL3144404 | {1-[1-(1-{2-[1-(Benzylamino-methyl)-3-methyl-butylcarbamoyl]-1-hydroxy-ethyl}-3-methyl-butylcarbamoyl)-2-phenyl-ethylcarbamoyl]-2-phenyl-ethyl}-carbamic acid tert-butyl ester
Type:
Small organic molecule
Emp. Form.:
C44H63N5O6
Mol. Mass.:
758.0009
SMILES:
CC(C)C[C@@H](CNCc1ccccc1)NC(=O)C[C@H](O)[C@H](CC(C)C)NC(=O)[C@H](Cc1ccccc1)NC(=O)[C@H](Cc1ccccc1)NC(=O)OC(C)(C)C
: