Target
Aldo-keto reductase family 1 member B1
Ligand
BDBM50025979
Substrate
Meas. Tech.
ChEMBL_31781 (CHEMBL643107)
IC50
4500±n/a nM
Citation
 Kador, PFKinoshita, JHSharpless, NE Aldose reductase inhibitors: a potential new class of agents for the pharmacological control of certain diabetic complications. J Med Chem 28:841-9 (1985)  
Target
Name:
Aldo-keto reductase family 1 member B1
Synonyms:
AKR1B1 ALDR_HUMAN AR Aldose Reductase (ALR2) Aldose reductase (AR)
Type:
Protein
Mol. Mass.:
35855.50
Organism:
Homo sapiens (Human)
Description:
P15121. 4LAU; 2IKI; 4LB4; 2FZD; 2FZ8; 1US0
Residue:
316
  
Inhibitor
Name:
BDBM50025979
Synonyms:
3-(Ethoxyoxalyl-amino)-2-hydroxy-5-nitro-benzoic acid | CHEMBL170853
Type:
Small organic molecule
Emp. Form.:
C11H10N2O8
Mol. Mass.:
298.2057
SMILES:
CCOC(=O)C(=O)Nc1cc(cc(C(O)=O)c1O)[N+]([O-])=O
: