Target
Aldo-keto reductase family 1 member B1
Ligand
BDBM50025975
Substrate
Meas. Tech.
ChEMBL_31782 (CHEMBL643108)
IC50
7200±n/a nM
Citation
 Kador, PFKinoshita, JHSharpless, NE Aldose reductase inhibitors: a potential new class of agents for the pharmacological control of certain diabetic complications. J Med Chem 28:841-9 (1985)  
Target
Name:
Aldo-keto reductase family 1 member B1
Synonyms:
AKR1B1 ALDR_HUMAN AR Aldose Reductase (ALR2) Aldose reductase (AR)
Type:
Protein
Mol. Mass.:
35855.50
Organism:
Homo sapiens (Human)
Description:
P15121. 4LAU; 2IKI; 4LB4; 2FZD; 2FZ8; 1US0
Residue:
316
  
Inhibitor
Name:
BDBM50025975
Synonyms:
3-Hydroxy-11-oxo-11H-pyrido[2,1-b]quinazoline-8-carboxylic acid | CHEMBL168614
Type:
Small organic molecule
Emp. Form.:
C13H8N2O4
Mol. Mass.:
256.2136
SMILES:
OC(=O)c1ccc2nc3cc(O)ccc3c(=O)n2c1
: