Target
Ephrin type-A receptor 2
Ligand
BDBM50234950
Substrate
Meas. Tech.
ChEMBL_1798954 (CHEMBL4271246)
Ki
>15000±n/a nM
Citation
 Lodola, AGiorgio, CIncerti, MZanotti, ITognolini, M Targeting Eph/ephrin system in cancer therapy. Eur J Med Chem 142:152-162 (2017)  
Target
Name:
Ephrin type-A receptor 2
Synonyms:
ECK EPHA2_HUMAN Epithelial cell kinase | Tyrosine-protein kinase receptor ECK
Type:
PROTEIN
Mol. Mass.:
108260.70
Organism:
Homo sapiens (Human)
Description:
ChEMBL_1505248
Residue:
976
  
Inhibitor
Name:
BDBM50234950
Synonyms:
CHEMBL4059908
Type:
Small organic molecule
Emp. Form.:
C36H52N2O3
Mol. Mass.:
560.8097
SMILES:
[H][C@@]1(CC[C@@]2([H])[C@]3([H])CC[C@]4([H])CCCC[C@]4(C)[C@@]3([H])CC[C@]12C)[C@H](C)CCC(=O)N[C@H](CC(O)=O)Cc1c[nH]c2ccccc12
: