Target
Quorum-sensing transcriptional repressor QscR
Ligand
BDBM50350703
Substrate
Meas. Tech.
ChEMBL_1799502 (CHEMBL4271794)
EC50
80±n/a nM
Citation
 Boursier, MEManson, DECombs, JBBlackwell, HE A comparative study of non-native N-acyl l-homoserine lactone analogs in two Pseudomonas aeruginosa quorum sensing receptors that share a common native ligand yet inversely regulate virulence. Bioorg Med Chem 26:5336-5342 (2018)  
Target
Name:
Quorum-sensing transcriptional repressor QscR
Synonyms:
PhzR
Type:
PROTEIN
Mol. Mass.:
27251.33
Organism:
Pseudomonas aeruginosa
Description:
ChEMBL_466843
Residue:
237
  
Inhibitor
Name:
BDBM50350703
Synonyms:
CHEMBL1814828
Type:
Small organic molecule
Emp. Form.:
C16H27NO3S
Mol. Mass.:
313.455
SMILES:
CCCCCCCCCC(=O)CC(=O)N[C@H]1CCSC1=O
: