Target
Quorum-sensing transcriptional repressor QscR
Ligand
BDBM50468432
Substrate
Meas. Tech.
ChEMBL_1799506 (CHEMBL4271798)
IC50
>250000±n/a nM
Citation
 Boursier, MEManson, DECombs, JBBlackwell, HE A comparative study of non-native N-acyl l-homoserine lactone analogs in two Pseudomonas aeruginosa quorum sensing receptors that share a common native ligand yet inversely regulate virulence. Bioorg Med Chem 26:5336-5342 (2018)  
Target
Name:
Quorum-sensing transcriptional repressor QscR
Synonyms:
PhzR
Type:
PROTEIN
Mol. Mass.:
27251.33
Organism:
Pseudomonas aeruginosa
Description:
ChEMBL_466843
Residue:
237
  
Inhibitor
Name:
BDBM50468432
Synonyms:
CHEMBL4285396
Type:
Small organic molecule
Emp. Form.:
C17H31NO3
Mol. Mass.:
297.4329
SMILES:
CCCCCCCCCC(=O)CC(=O)NCC1CCCO1
: