Target
5-hydroxytryptamine receptor 1B
Ligand
BDBM50007406
Substrate
Meas. Tech.
ChEMBL_201213 (CHEMBL804009)
Ki
298±n/a nM
Citation
 Huff, JRKing, SWSaari, WSSpringer, JPMartin, GEWilliams, M Bioactive conformation of 1-arylpiperazines at central serotonin receptors. J Med Chem 28:945-8 (1985)  
Target
Name:
5-hydroxytryptamine receptor 1B
Synonyms:
5-HT-1B 5-hydroxytryptamine receptor 1B (5HT1B) 5ht1b Serotonin 1 (5-HT1) receptor Serotonin receptor 1B
Type:
Protein
Mol. Mass.:
43173.33
Organism:
Rattus norvegicus (Rat)
Description:
P28564
Residue:
386
  
Inhibitor
Name:
BDBM50007406
Synonyms:
1-(3-(trifluoromethyl)phenyl)piperazine 1-(3-Trifluoromethyl-phenyl)-piperazine(TFMPP) TFMPP
Type:
Small organic molecule
Emp. Form.:
C11H13F3N2
Mol. Mass.:
230.2295
SMILES:
FC(F)(F)c1cccc(c1)N1CCNCC1
: