Target
Adenosine receptor A3
Ligand
BDBM21221
Substrate
Meas. Tech.
ChEMBL_1802981 (CHEMBL4275273)
Ki
1.4±n/a nM
Citation
 Federico, SMargiotta, ESalmaso, VPastorin, GKachler, SKlotz, KNMoro, SSpalluto, G [1,2,4]Triazolo[1,5-c]pyrimidines as adenosine receptor antagonists: Modifications at the 8 position to reach selectivity towards A Eur J Med Chem 157:837-851 (2018)  
Target
Name:
Adenosine receptor A3
Synonyms:
A3 adenosine receptor (hA3) ADORA3 | Adenosine A3 receptor (A3AR)
Type:
G Protein-Coupled Receptor (GPCR)
Mol. Mass.:
36197.32
Organism:
Homo sapiens (Human)
Description:
P0DMS8
Residue:
318
  
Inhibitor
Name:
BDBM21221
Synonyms:
(2S,3S,4R,5R)-5-(2-chloro-6-{[(3-iodophenyl)methyl]amino}-9H-purin-9-yl)-3,4-dihydroxy-N-methyloxolane-2-carboxamide 2-chloro-N6-(3-iodobenzyl)adenosine-5-N-methylcarboxamide C1-IB-MECA CI-IB-MECA US20230364057, Compound 76
Type:
Small organic molecule
Emp. Form.:
C18H18ClIN6O4
Mol. Mass.:
544.731
SMILES:
CNC(=O)[C@H]1O[C@H]([C@H](O)[C@@H]1O)n1cnc2c(NCc3cccc(I)c3)nc(Cl)nc12
: