Target
Voltage-dependent L-type calcium channel subunit alpha-1S
Ligand
BDBM50469633
Substrate
Meas. Tech.
ChEMBL_217681 (CHEMBL819975)
Ki
0.290000±n/a nM
Citation
  TBA Bioorg Med Chem Lett 4:1235-1240 (1994)    Article 
Target
Name:
Voltage-dependent L-type calcium channel subunit alpha-1S
Synonyms:
CAC1S_RAT Cacn1 Cacnl1a3 Cchl1a3 Voltage-gated L-type calcium channel Voltage-gated calcium channel subunit alpha Cav1.1
Type:
PROTEIN
Mol. Mass.:
210392.58
Organism:
Rattus norvegicus
Description:
ChEMBL_92777
Residue:
1850
  
Inhibitor
Name:
BDBM50469633
Synonyms:
CHEMBL21906
Type:
Small organic molecule
Emp. Form.:
C17H15NOS
Mol. Mass.:
281.372
SMILES:
O=C1CCC2C(Sc3ccccc3N12)c1ccccc1
: