Target
Estrogen receptor beta
Ligand
BDBM20607
Substrate
Meas. Tech.
ChEMBL_66075 (CHEMBL683105)
Ki
34±n/a nM
Citation
 Gauthier, SCaron, BCloutier, JDory, YLFavre, ALarouche, DMailhot, JOuellet, CSchwerdtfeger, ALeblanc, GMartel, CSimard, JMérand, YBélanger, ALabrie, CLabrie, F (S)-(+)-4-[7-(2,2-dimethyl-1-oxopropoxy)-4-methyl-2-[4-[2-(1-piperidinyl)-ethoxy]phenyl]-2H-1-benzopyran-3-yl]-phenyl 2,2-dimethylpropanoate (EM-800): a highly potent, specific, and orally active nonsteroidal antiestrogen. J Med Chem 40:2117-22 (1997)  
Target
Name:
Estrogen receptor beta
Synonyms:
Estrogen receptor
Type:
Mol. Mass.:
Description:
ASSAY_ID of ChEMBL is 99778
Components:
This complex has 2 components.
Component 1
Name:
Estrogen receptor beta
Synonyms:
ER-beta ESR2_HUMAN Estradiol receptor beta (ERβ) Estrogen receptor (ER beta) Estrogen receptor beta (ER beta) NR3A2 estrogen beta
Type:
Protein
Mol. Mass.:
59238.43
Organism:
Homo sapiens (Human)
Description:
Q92731
Residue:
530
  
Component 2
Name:
Estrogen receptor
Synonyms:
ER ESR ESR1_HUMAN Estrogen receptor Estrogen receptor (ER-alpha) Estrogen receptor alpha (ER) Nuclear receptor subfamily 3 group A member 1
Type:
Protein
Mol. Mass.:
66230.44
Organism:
Homo sapiens (Human)
Description:
P03372
Residue:
595
  
Inhibitor
Name:
BDBM20607
Synonyms:
(2-{4-[(1Z)-1,2-diphenylbut-1-en-1-yl]phenoxy}ethyl)dimethylamine CHEMBL83 NCGC00024928 Tamoxifen Tamoxifen, 7 med.21724, Compound Tamoxifen
Type:
Small organic molecule
Emp. Form.:
C26H29NO
Mol. Mass.:
371.5146
SMILES:
CC\C(=C(/c1ccccc1)c1ccc(OCCN(C)C)cc1)c1ccccc1
: