Target
Peroxisome proliferator-activated receptor gamma
Ligand
BDBM50085044
Substrate
Meas. Tech.
ChEMBL_154380 (CHEMBL759143)
EC50
0.338844±n/a nM
Citation
 Collins, JLBlanchard, SGBoswell, GECharifson, PSCobb, JEHenke, BRHull-Ryde, EAKazmierski, WMLake, DHLeesnitzer, LMLehmann, JLenhard, JMOrband-Miller, LAGray-Nunez, YParks, DJPlunkett, KDTong, WQ N-(2-Benzoylphenyl)-L-tyrosine PPARgamma agonists. 2. Structure-activity relationship and optimization of the phenyl alkyl ether moiety. J Med Chem 41:5037-54 (1998)  
Target
Name:
Peroxisome proliferator-activated receptor gamma
Synonyms:
NR1C3 PPAR-gamma PPARG_HUMAN Peroxisome proliferator-activated receptor gamma (PPAR gamma) Peroxisome proliferator-activated receptor gamma (PPARĪ³) peroxisome proliferator-activated receptor gamma isoform 2
Type:
Nuclear Receptor
Mol. Mass.:
57613.46
Organism:
Homo sapiens (Human)
Description:
P37231
Residue:
505
  
Inhibitor
Name:
BDBM50085044
Synonyms:
(S)-2-(2-Benzoyl-phenylamino)-3-{4-[2-(5-methyl-2-phenyl-oxazol-4-yl)-ethoxy]-phenyl}-propionic acid 2-(2-BENZOYL-PHENYLAMINO)-3-{4-[2-(5-METHYL-2-PHENYL-OXAZOL-4-YL)-ETHOXY]-PHENYL}-PROPIONIC ACID CHEMBL107367 | Farglitazar
Type:
Small organic molecule
Emp. Form.:
C34H30N2O5
Mol. Mass.:
546.6124
SMILES:
Cc1oc(nc1CCOc1ccc(C[C@H](Nc2ccccc2C(=O)c2ccccc2)C(O)=O)cc1)-c1ccccc1
: