Target
Prothrombin
Ligand
BDBM50472457
Substrate
Meas. Tech.
ChEMBL_209062 (CHEMBL815654)
Ki
32±n/a nM
Citation
 Böhm, MSt rzebecher, JKlebe, G Three-dimensional quantitative structure-activity relationship analyses using comparative molecular field analysis and comparative molecular similarity indices analysis to elucidate selectivity differences of inhibitors binding to trypsin, thrombin, and factor Xa. J Med Chem 42:458-77 (1999)  
Target
Name:
Prothrombin
Synonyms:
Activation peptide fragment 1 Coagulation factor II Prothrombin Thrombin Thrombin light chain
Type:
Enzyme
Mol. Mass.:
70502.73
Organism:
Bos taurus (Bovine)
Description:
P00735
Residue:
625
  
Inhibitor
Name:
BDBM50472457
Synonyms:
CHEMBL423195
Type:
Small organic molecule
Emp. Form.:
C25H35N5O6S2
Mol. Mass.:
565.705
SMILES:
[H][C@@](Cc1cccc(c1)C(N)=N)(NS(=O)(=O)c1c(C)cc(OC)c(C)c1C)C(=O)N1CCN(CC1)S(C)(=O)=O
: