Target
Prothrombin
Ligand
BDBM50472506
Substrate
Meas. Tech.
ChEMBL_209062 (CHEMBL815654)
Ki
120±n/a nM
Citation
 Böhm, MSt rzebecher, JKlebe, G Three-dimensional quantitative structure-activity relationship analyses using comparative molecular field analysis and comparative molecular similarity indices analysis to elucidate selectivity differences of inhibitors binding to trypsin, thrombin, and factor Xa. J Med Chem 42:458-77 (1999)  
Target
Name:
Prothrombin
Synonyms:
Activation peptide fragment 1 Coagulation factor II Prothrombin Thrombin Thrombin light chain
Type:
Enzyme
Mol. Mass.:
70502.73
Organism:
Bos taurus (Bovine)
Description:
P00735
Residue:
625
  
Inhibitor
Name:
BDBM50472506
Synonyms:
CHEMBL1161248
Type:
Small organic molecule
Emp. Form.:
C30H26N4O5S
Mol. Mass.:
554.616
SMILES:
[H][C@@](Cc1cccc(c1)C(N)=N)(NS(=O)(=O)c1ccc2ccccc2c1)C(=O)N1Cc2ccccc2C=C1C(O)=O
: