Target
Cannabinoid receptor 1
Ligand
BDBM50284000
Substrate
Meas. Tech.
ChEMBL_46468 (CHEMBL858761)
Ki
9.5±n/a nM
Citation
 Fichera, MCruciani, GBianchi, AMusumarra, G A 3D-QSAR study on the structural requirements for binding to CB(1) and CB(2) cannabinoid receptors. J Med Chem 43:2300-9 (2000)  
Target
Name:
Cannabinoid receptor 1
Synonyms:
CANN6 CB-R CNR CNR1_HUMAN Cannabinoid receptor Cannabinoid receptor 1 (brain)
Type:
G Protein-Coupled Receptor (GPCR)
Mol. Mass.:
52868.96
Organism:
Homo sapiens (Human)
Description:
P21554
Residue:
472
  
Inhibitor
Name:
BDBM50284000
Synonyms:
(2-Methyl-1-pentyl-1H-indol-3-yl)-naphthalen-1-yl-methanone (2-methyl-1-pentyl-1H-indol-3-yl)(naphthalen-1-yl)methanone JWH-007
Type:
Small organic molecule
Emp. Form.:
C25H25NO
Mol. Mass.:
355.4721
SMILES:
CCCCCn1c(C)c(C(=O)c2cccc3ccccc23)c2ccccc12
: