Target
Mitogen-activated protein kinase 13
Ligand
BDBM50473632
Substrate
Meas. Tech.
ChEMBL_124318 (CHEMBL732626)
IC50
5.0±n/a nM
Citation
 McKenna, JMHalley, FSouness, JEMcLay, IMPickett, SDCollis, AJPage, KAhmed, I An algorithm-directed two-component library synthesized via solid-phase methodology yielding potent and orally bioavailable p38 MAP kinase inhibitors. J Med Chem 45:2173-84 (2002)  
Target
Name:
Mitogen-activated protein kinase 13
Synonyms:
MAP kinase 13 MAPK 13 Mapk13 Mitogen-activated protein kinase p38 delta Stress-activated protein kinase 4
Type:
PROTEIN
Mol. Mass.:
42081.17
Organism:
Mus musculus
Description:
ChEMBL_105000
Residue:
366
  
Inhibitor
Name:
BDBM50473632
Synonyms:
CHEMBL71425 | RPR-239457
Type:
Small organic molecule
Emp. Form.:
C26H29FN6O3
Mol. Mass.:
492.5453
SMILES:
C[C@@]1(CO[C@@H](OC1)c1nc(c([nH]1)-c1ccnc(NCC2CC2)n1)-c1ccc(F)cc1)C(=O)NC1CC1
: