Target
Prothrombin
Ligand
BDBM50027284
Substrate
Meas. Tech.
ChEBML_210591
Ki
2240±n/a nM
Citation
 Tidwell, RRGeratz, JDDubovi, EJ Aromatic amidines: comparison of their ability to block respiratory syncytial virus induced cell fusion and to inhibit plasmin, urokinase, thrombin, and trypsin. J Med Chem 26:294-8 (1983)  
Target
Name:
Prothrombin
Synonyms:
Activation peptide fragment 1 Coagulation factor II Prothrombin Thrombin Thrombin light chain
Type:
Enzyme
Mol. Mass.:
70502.73
Organism:
Bos taurus (Bovine)
Description:
P00735
Residue:
625
  
Inhibitor
Name:
BDBM50027284
Synonyms:
2-{4-[5-(4-Carbamimidoyl-phenoxy)-pentyloxy]-phenyl}-1H-benzoimidazole-5-carboxamidine | CHEMBL101672
Type:
Small organic molecule
Emp. Form.:
C26H28N6O2
Mol. Mass.:
456.5395
SMILES:
NC(=N)c1ccc(OCCCCCOc2ccc(cc2)-c2nc3ccc(cc3[nH]2)C(N)=N)cc1
: