Target
Voltage-dependent L-type calcium channel subunit alpha-1S
Ligand
BDBM50473868
Substrate
Meas. Tech.
ChEMBL_217676 (CHEMBL819970)
Ki
217±n/a nM
Citation
 Grauert, MBechtel, WDWeiser, TStransky, WNar, HCarter, AJ Synthesis and structure-activity relationships of 6,7-benzomorphan derivatives as use-dependent sodium channel blockers for the treatment of stroke. J Med Chem 45:3755-64 (2002)  
Target
Name:
Voltage-dependent L-type calcium channel subunit alpha-1S
Synonyms:
CAC1S_RAT Cacn1 Cacnl1a3 Cchl1a3 Voltage-gated L-type calcium channel Voltage-gated calcium channel subunit alpha Cav1.1
Type:
PROTEIN
Mol. Mass.:
210392.58
Organism:
Rattus norvegicus
Description:
ChEMBL_92777
Residue:
1850
  
Inhibitor
Name:
BDBM50473868
Synonyms:
CHEMBL339108
Type:
Small organic molecule
Emp. Form.:
C24H31NO2
Mol. Mass.:
365.5084
SMILES:
[H][C@]12Cc3c(O)cccc3C(C)(CCN1CCOCc1ccccc1)C2(C)C
: