Target
Glycogen phosphorylase, brain form
Ligand
BDBM34103
Substrate
Meas. Tech.
ChEMBL_70996 (CHEMBL680572)
Ki
7940000±n/a nM
Citation
 Gohlke, HKlebe, G DrugScore meets CoMFA: adaptation of fields for molecular comparison (AFMoC) or how to tailor knowledge-based pair-potentials to a particular protein. J Med Chem 45:4153-70 (2002)  
Target
Name:
Glycogen phosphorylase, brain form
Synonyms:
Brain glycogen phosphorylase PYGB | PYGB_HUMAN
Type:
PROTEIN
Mol. Mass.:
96699.35
Organism:
Homo sapiens (Human)
Description:
ChEMBL_70998
Residue:
843
  
Inhibitor
Name:
BDBM34103
Synonyms:
D-glucose glucose
Type:
Emp. Form.:
C6H12O6
Mol. Mass.:
180.1559
SMILES:
OC[C@H]1OC(O)[C@H](O)[C@@H](O)[C@@H]1O
: