Target
Histone deacetylase
Ligand
BDBM50082657
Substrate
Meas. Tech.
ChEMBL_305871 (CHEMBL831915)
IC50
256±n/a nM
Citation
 Heltweg, BDequiedt, FMarshall, BLBrauch, CYoshida, MNishino, NVerdin, EJung, M Subtype selective substrates for histone deacetylases. J Med Chem 47:5235-43 (2004)  
Target
Name:
Histone deacetylase
Synonyms:
Hdac5 | Hdac5 protein
Type:
PROTEIN
Mol. Mass.:
34754.92
Organism:
Rattus norvegicus
Description:
ChEMBL_104809
Residue:
328
  
Inhibitor
Name:
BDBM50082657
Synonyms:
4-Dimethylamino-N-(7-hydroxycarbamoyl-heptyl)-benzamide | CHEMBL143047
Type:
Small organic molecule
Emp. Form.:
C17H27N3O3
Mol. Mass.:
321.4146
SMILES:
CN(C)c1ccc(cc1)C(=O)NCCCCCCCC(=O)NO
: