Target
Melatonin receptor type 1B
Ligand
BDBM50240440
Substrate
Meas. Tech.
ChEMBL_304060 (CHEMBL839735)
Ki
0.015849±n/a nM
Citation
 Rivara, SLorenzi, SMor, MPlazzi, PVSpadoni, GBedini, ATarzia, G Analysis of structure-activity relationships for MT2 selective antagonists by melatonin MT1 and MT2 receptor models. J Med Chem 48:4049-60 (2005)  
Target
Name:
Melatonin receptor type 1B
Synonyms:
MTNR1B Mel-1B-R Melatonin 1B Melatonin receptor type 1B | Melatonin receptor type 2 (MT2)
Type:
Enzyme
Mol. Mass.:
40203.54
Organism:
Homo sapiens (Human)
Description:
P49286
Residue:
362
  
Inhibitor
Name:
BDBM50240440
Synonyms:
4-P-PDOT N-(4-Phenyl-1,2,3,4-tetrahydro-naphthalen-2-yl)-propionamide | N-(4-phenyl-1,2,3,4-tetrahydronaphthalen-2-yl)propionamide
Type:
Small organic molecule
Emp. Form.:
C19H21NO
Mol. Mass.:
279.3761
SMILES:
CCC(=O)NC1CC(c2ccccc2)c2ccccc2C1
: