Target
Retinoic acid receptor beta
Ligand
BDBM50052414
Substrate
Meas. Tech.
ChEMBL_326476 (CHEMBL864468)
EC50
20±n/a nM
Citation
 Lund, BWPiu, FGauthier, NKEeg, ACurrier, ESherbukhin, VBrann, MRHacksell, UOlsson, R Discovery of a potent, orally available, and isoform-selective retinoic acid beta2 receptor agonist. J Med Chem 48:7517-9 (2005)  
Target
Name:
Retinoic acid receptor beta
Synonyms:
HAP NR1B2 RAR-beta RARB Retinoic acid receptor RXR-alpha/Retinoic acid receptor beta Retinoid receptor
Type:
PROTEIN
Mol. Mass.:
50498.70
Organism:
Homo sapiens (Human)
Description:
ChEMBL_1458015
Residue:
455
  
Inhibitor
Name:
BDBM50052414
Synonyms:
4-(1,1,4,4-tetramethyl-1,2,3,4-tetrahydronaphthalene-7-carboxamido)benzoic acid 4-[(5,5,8,8-Tetramethyl-5,6,7,8-tetrahydro-naphthalene-2-carbonyl)-amino]-benzoic acid CHEMBL69367 | US9963439, AM580
Type:
Small organic molecule
Emp. Form.:
C22H25NO3
Mol. Mass.:
351.4388
SMILES:
CC1(C)CCC(C)(C)c2cc(ccc12)C(=O)Nc1ccc(cc1)C(O)=O
: