Target
Tubulin beta chain
Ligand
BDBM50014846
Substrate
Meas. Tech.
ChEMBL_422811 (CHEMBL856530)
IC50
1400±n/a nM
Citation
 Zuse, ASchmidt, PBaasner, SBöhm, KJMüller, KGerlach, MGünther, EGUnger, EPrinz, H 9-Benzylidene-naphtho[2,3-b]thiophen-4-ones as novel antimicrotubule agents-synthesis, antiproliferative activity, and inhibition of tubulin polymerization. J Med Chem 49:7816-25 (2006)  
Target
Name:
Tubulin beta chain
Synonyms:
Beta-tubulin Tubulin beta chain
Type:
PROTEIN
Mol. Mass.:
49840.26
Organism:
Sus scrofa
Description:
ChEMBL_105107
Residue:
445
  
Inhibitor
Name:
BDBM50014846
Synonyms:
(S)-N-(5,6,7,9-tetrahydro-1,2,3,10-tetramethoxy-9-oxobenzo[a]heptalen-7-yl)acetamide 7alphaH-colchicine COLCHICINE colchicina | colchicinum
Type:
Small organic molecule
Emp. Form.:
C22H25NO6
Mol. Mass.:
399.437
SMILES:
COc1cc2CC[C@H](NC(C)=O)c3cc(=O)c(OC)ccc3-c2c(OC)c1OC
: