Target
Cholesterol side-chain cleavage enzyme, mitochondrial
Ligand
BDBM50350465
Substrate
Meas. Tech.
ChEMBL_424409 (CHEMBL910687)
IC50
28.6±n/a nM
Citation
 Tandon, VKMaurya, HKYadav, DBTripathi, AKumar, MShukla, PK Naphtho[2,3-b][1,4]-thiazine-5,10-diones and 3-substituted-1,4-dioxo-1,4-dihydronaphthalen-2-yl-thioalkanoate derivatives: synthesis and biological evaluation as potential antibacterial and antifungal agents. Bioorg Med Chem Lett 16:5883-7 (2006)  
Target
Name:
Cholesterol side-chain cleavage enzyme, mitochondrial
Synonyms:
CP11A_RAT Cyp11a-1 Cytochrome P450 11A1
Type:
PROTEIN
Mol. Mass.:
60603.33
Organism:
Rattus norvegicus
Description:
ChEMBL_50353
Residue:
526
  
Inhibitor
Name:
BDBM50350465
Synonyms:
AMPICILLIN Amcill Ampicillin sulfate
Type:
Small organic molecule
Emp. Form.:
C16H19N3O4S
Mol. Mass.:
349.405
SMILES:
CC1(C)S[C@@H]2[C@H](NC(=O)[C@H](N)c3ccccc3)C(=O)N2[C@H]1C(O)=O
: