Target
Pepsin A
Ligand
BDBM50027905
Substrate
Meas. Tech.
ChEBML_154017
Ki
1.1±n/a nM
Citation
 Rich, DHSalituro, FG Synthesis of analogues of pepstatin. Effect of structure in subsites P1', P2', and P2 on inhibition of porcine pepsin. J Med Chem 26:904-10 (1983)  
Target
Name:
Pepsin A
Synonyms:
PEPA_PIG Pepsin | Pepsin A precursor
Type:
Enzyme
Mol. Mass.:
41232.87
Organism:
Porcine
Description:
Residue:
385
  
Inhibitor
Name:
BDBM50027905
Synonyms:
3-Hydroxy-6-methyl-4-[3-methyl-2-(3-methyl-butyrylamino)-butyrylamino]-heptanoic acid [1-(isobutyl-methyl-carbamoyl)-ethyl]-amide | CHEMBL174197
Type:
Small organic molecule
Emp. Form.:
C28H52N4O7
Mol. Mass.:
556.7351
SMILES:
COC(=O)C(CC(C)C)NC(=O)C(C)NC(=O)CC(O)C(CC(C)C)NC(=O)C(NC(=O)CC(C)C)C(C)C
: