Target
Mitogen-activated protein kinase 11/12/13/14
Ligand
BDBM50209771
Substrate
Meas. Tech.
ChEMBL_434379 (CHEMBL919857)
IC50
0.740000±n/a nM
Citation
 Hauser, DRScior, TDomeyer, DMKammerer, BLaufer, SA Synthesis, biological testing, and binding mode prediction of 6,9-diarylpurin-8-ones as p38 MAP kinase inhibitors. J Med Chem 50:2060-6 (2007)  
Target
Name:
Mitogen-activated protein kinase 11/12/13/14
Synonyms:
MAP kinase p38
Type:
Mol. Mass.:
Description:
ASSAY_ID of ChEMBL is 1935922
Components:
This complex has 4 components.
Component 1
Name:
Mitogen-activated protein kinase 13
Synonyms:
MAP kinase p38 delta MK13_HUMAN Mitogen-activated protein kinase 13 (MAPK13) Mitogen-activated protein kinase p38 delta SAPK4 p38 delta/gamma
Type:
Enzyme
Mol. Mass.:
42097.16
Organism:
Homo sapiens (Human)
Description:
O15264
Residue:
365
  
Component 2
Name:
Mitogen-activated protein kinase 11
Synonyms:
MAP kinase p38 MK11_HUMAN Mitogen-activated protein kinase p38 beta SAPK2 Stress-activated protein kinase 2 p38-2 p38b
Type:
Enzyme Catalytic Domain
Mol. Mass.:
41351.73
Organism:
Homo sapiens (Human)
Description:
gi_20128774
Residue:
364
  
Component 3
Name:
Mitogen-activated protein kinase 14
Synonyms:
CSAID-binding protein CSBP1 CSPB1 MAP kinase 14 MAP kinase p38 alpha MAPK14 MK14_HUMAN Mitogen-activated protein kinase p38 alpha Stress-activated protein kinase 2a | p38 MAP kinase alpha/beta
Type:
Serine/threonine-protein kinase
Mol. Mass.:
41286.76
Organism:
Homo sapiens (Human)
Description:
Q16539
Residue:
360
  
Component 4
Name:
Mitogen-activated protein kinase 12
Synonyms:
ERK6 MAPK12 Mitogen-activated protein kinase 12 (MAPK12 p38 gamma) Mitogen-activated protein kinase 12 Gamma SAPK3 | p38 delta/gamma
Type:
Protein
Mol. Mass.:
41938.69
Organism:
Homo sapiens (Human)
Description:
P53778
Residue:
367
  
Inhibitor
Name:
BDBM50209771
Synonyms:
3,4-dihydroquinolin-2(1H)-one Dihydro-quinolinone
Type:
Small organic molecule
Emp. Form.:
C9H9NO
Mol. Mass.:
147.1739
SMILES:
O=C1CCc2ccccc2N1
: