Target
Amyloid-beta precursor protein
Ligand
BDBM50476296
Substrate
Meas. Tech.
ChEMBL_434822 (CHEMBL918464)
Ki
1.5±n/a nM
Citation
 Chandra, ROya, SKung, MPHou, CJin, LWKung, HF New diphenylacetylenes as probes for positron emission tomographic imaging of amyloid plaques. J Med Chem 50:2415-23 (2007)  
Target
Name:
Amyloid-beta precursor protein
Synonyms:
A4 ABPP AICD-50 AICD-59 AID(57) APP Alzheimer disease amyloid protein Amyloid beta Protein Amyloid beta protein Abeta(1-42) Amyloid intracellular domain 57 Amyloid protein (Abeta42b) Beta amyloid A4 protein Beta-APP42 Beta-amyloid protein 42 C83 CVAP Gamma Secretase Gamma-CTF(57) Gamma-secretase Gamma-secretase C-terminal fragment 57 P3(40) PN-II Protease nexin-II S-APP-beta Soluble APP-beta | beta-Amyloid Precursor Protein (APP)
Type:
Single-pass type I membrane protein
Mol. Mass.:
86890.41
Organism:
Homo sapiens (Human)
Description:
P05067
Residue:
770
  
Inhibitor
Name:
BDBM50476296
Synonyms:
CHEMBL228033
Type:
Small organic molecule
Emp. Form.:
C15H13NO
Mol. Mass.:
223.2698
SMILES:
CNc1ccc(cc1)C#Cc1ccc(O)cc1
: