Target
Muscarinic acetylcholine receptor M2
Ligand
BDBM50008072
Substrate
Meas. Tech.
ChEMBL_470967 (CHEMBL923036)
Ki
12023±n/a nM
Citation
 Vistoli, GPedretti, ADei, SScapecchi, SMarconi, CRomanelli, MN Docking analyses on human muscarinic receptors: unveiling the subtypes peculiarities in agonists binding. Bioorg Med Chem 16:3049-58 (2008)  
Target
Name:
Muscarinic acetylcholine receptor M2
Synonyms:
ACM2_HUMAN Cholinergic, muscarinic M2 Muscarinic acetylcholine receptor M2 and M5 | RecName: Full=Muscarinic acetylcholine receptor M2
Type:
GPCR
Mol. Mass.:
51730.61
Organism:
Homo sapiens (Human)
Description:
P08172
Residue:
466
  
Inhibitor
Name:
BDBM50008072
Synonyms:
(+)-pilocarpine (3S,4R)-3-ethyldihydro-4-((1-methyl-1H-imidazol-5-yl)methyl)-2(3H)-furanone CHEMBL550 PILOCARPINE | PILOCARPINE HYDROCHLORIDE
Type:
Small organic molecule
Emp. Form.:
C11H16N2O2
Mol. Mass.:
208.2569
SMILES:
CC[C@H]1[C@@H](Cc2cncn2C)COC1=O
: