Target
Reverse transcriptase
Ligand
BDBM50011181
Substrate
Meas. Tech.
ChEMBL_508733 (CHEMBL1004027)
IC50
>5000±n/a nM
Citation
 Grobler, JADornadula, GRice, MRSimcoe, ALHazuda, DJMiller, MD HIV-1 reverse transcriptase plus-strand initiation exhibits preferential sensitivity to non-nucleoside reverse transcriptase inhibitors in vitro. J Biol Chem 282:8005-10 (2007)  
Target
Name:
Reverse transcriptase
Synonyms:
Type:
Protein
Mol. Mass.:
29598.37
Organism:
Human immunodeficiency virus 1
Description:
Q9WKE8
Residue:
254
  
Inhibitor
Name:
BDBM50011181
Synonyms:
(PFA)dihydroxyphosphinecarboxylic acid oxide FOSCARNET Foscarnet (PFA) Phosphono-formic acid(PFA) dihydroxyphosphinecarboxylic acid oxide phosphonoformic acid(PFA)
Type:
Small organic molecule
Emp. Form.:
CH3O5P
Mol. Mass.:
126.0053
SMILES:
OC(=O)P(O)(O)=O
: