Target
Pepsin A
Ligand
BDBM50028392
Substrate
Meas. Tech.
ChEBML_154018
Ki
7.5±n/a nM
Citation
 Rich, DHBernatowicz, MS Synthesis of analogues of the carboxyl protease inhibitor pepstatin. Effect of structure in subsite P3 on inhibition of pepsin. J Med Chem 25:791-5 (1982)  
Target
Name:
Pepsin A
Synonyms:
PEPA_PIG Pepsin | Pepsin A precursor
Type:
Enzyme
Mol. Mass.:
41232.87
Organism:
Porcine
Description:
Residue:
385
  
Inhibitor
Name:
BDBM50028392
Synonyms:
4-[2-(3,3-Dimethyl-2-oxo-butylamino)-3-methyl-butyrylamino]-3-hydroxy-6-methyl-heptanoic acid [1-(3-methyl-butylcarbamoyl)-ethyl]-amide | CHEMBL167297
Type:
Small organic molecule
Emp. Form.:
C27H52N4O5
Mol. Mass.:
512.7256
SMILES:
CC(C)CCNC(=O)[C@H](C)NC(=O)C[C@H](O)[C@H](CC(C)C)NC(=O)[C@@H](NCC(=O)C(C)(C)C)C(C)C
: