Target
Voltage-dependent L-type calcium channel subunit alpha-1S
Ligand
BDBM50479923
Substrate
Meas. Tech.
ChEMBL_563140 (CHEMBL1009068)
Ki
200±n/a nM
Citation
 Budriesi, RCosimelli, BIoan, PUgenti, MPCarosati, EFrosini, MFusi, FSpisani, RSaponara, SCruciani, GNovellino, ESpinelli, DChiarini, A L-Type calcium channel blockers: from diltiazem to 1,2,4-oxadiazol-5-ones via thiazinooxadiazol-3-one derivatives. J Med Chem 52:2352-62 (2009)  
Target
Name:
Voltage-dependent L-type calcium channel subunit alpha-1S
Synonyms:
CAC1S_RAT Cacn1 Cacnl1a3 Cchl1a3 Voltage-gated L-type calcium channel Voltage-gated calcium channel subunit alpha Cav1.1
Type:
PROTEIN
Mol. Mass.:
210392.58
Organism:
Rattus norvegicus
Description:
ChEMBL_92777
Residue:
1850
  
Inhibitor
Name:
BDBM50479923
Synonyms:
CHEMBL521744
Type:
Small organic molecule
Emp. Form.:
C24H16Br2N4O6S2
Mol. Mass.:
680.345
SMILES:
C\C(=C\SS\C=C(\C)n1c(noc1=O)C(=O)c1ccc(Br)cc1)n1c(noc1=O)C(=O)c1ccc(Br)cc1
: