Target
Voltage-dependent L-type calcium channel subunit alpha-1S
Ligand
BDBM50004704
Substrate
Meas. Tech.
ChEMBL_563140 (CHEMBL1009068)
Ki
85±n/a nM
Citation
 Budriesi, RCosimelli, BIoan, PUgenti, MPCarosati, EFrosini, MFusi, FSpisani, RSaponara, SCruciani, GNovellino, ESpinelli, DChiarini, A L-Type calcium channel blockers: from diltiazem to 1,2,4-oxadiazol-5-ones via thiazinooxadiazol-3-one derivatives. J Med Chem 52:2352-62 (2009)  
Target
Name:
Voltage-dependent L-type calcium channel subunit alpha-1S
Synonyms:
CAC1S_RAT Cacn1 Cacnl1a3 Cchl1a3 Voltage-gated L-type calcium channel Voltage-gated calcium channel subunit alpha Cav1.1
Type:
PROTEIN
Mol. Mass.:
210392.58
Organism:
Rattus norvegicus
Description:
ChEMBL_92777
Residue:
1850
  
Inhibitor
Name:
BDBM50004704
Synonyms:
(+)-cis-Diltiazem 5-(2-dimethylamino-ethyl)-2-(4-methoxy-phenyl)-4-oxo-2,3,4,5-tetrahydro-benzo[b][1,4]thiazepin-3-yl ester(Diltiazem)Acetic acid Acetic acid (2S,3S)-5-(2-dimethylamino-ethyl)-2-(4-methoxy-phenyl)-4-oxo-2,3,4,5-tetrahydro-benzo[b][1,4]thiazepin-3-yl ester Acetic acid 5-(2-dimethylamino-ethyl)-2-(4-methoxy-phenyl)-4-oxo-2,3,4,5-tetrahydro-benzo[b][1,4]thiazepin-3-yl ester Acetic acid 5-(2-dimethylamino-ethyl)-2-(4-methoxy-phenyl)-4-oxo-2,3,4,5-tetrahydro-benzo[b][1,4]thiazepin-3-yl ester(cis-(+)-Diltiazem) CHEMBL23 DILTIAZEM Diltzac Tiamate cis-Acetic acid 5-(2-dimethylamino-ethyl)-2-(4-methoxy-phenyl)-4-oxo-2,3,4,5-tetrahydro-benzo[b][1,4]thiazepin-3-yl ester | diltiazem;Acetic acid 5-(2-dimethylamino-ethyl)-2-(4-methoxy-phenyl)-4-oxo-2,3,4,5-tetrahydro-benzo[b][1,4]thiazepin-3-yl ester
Type:
Small organic molecule
Emp. Form.:
C22H26N2O4S
Mol. Mass.:
414.518
SMILES:
COc1ccc(cc1)[C@@H]1Sc2ccccc2N(CCN(C)C)C(=O)[C@@H]1OC(C)=O
: