Target
Replicase polyprotein 1ab
Ligand
BDBM50480133
Substrate
Meas. Tech.
ChEMBL_520671 (CHEMBL965235)
IC50
3800±n/a nM
Citation
 Yang, CWYang, YNLiang, PHChen, CMChen, WLChang, HYChao, YSLee, SJ Novel small-molecule inhibitors of transmissible gastroenteritis virus. Antimicrob Agents Chemother 51:3924-31 (2007)  
Target
Name:
Replicase polyprotein 1ab
Synonyms:
3C-like proteinase 3C-like proteinase (SARS-CoV 3Cpro) 3CLp GFL Guanine-N7 methyltransferase Helicase Leader protein Non-structural protein 10 Non-structural protein 3 Non-structural protein 6 Non-structural protein 8 ORF1ab polyprotein PL2-PRO Pol R1AB_SARS RdRp SARS coronavirus main proteinase nsp1 nsp12 nsp14 nsp16 nsp3 nsp5 nsp7 nsp9 pp1ab | rep
Type:
Protein
Mol. Mass.:
790250.81
Organism:
Human SARS coronavirus (SARS-CoV) (Severe acute respiratory syndrome coronavirus)
Description:
P0C6X7
Residue:
7073
  
Inhibitor
Name:
BDBM50480133
Synonyms:
CHEMBL540403
Type:
Small organic molecule
Emp. Form.:
C33H29ClN2S2
Mol. Mass.:
553.18
SMILES:
[Cl-].CCN1\C(SC(=C1c1ccccc1)c1ccccc1)=C/C=C/c1sc2c(ccc3ccccc23)[n+]1CC
: