Target
Replicase polyprotein 1ab
Ligand
BDBM50480137
Substrate
Meas. Tech.
ChEMBL_520671 (CHEMBL965235)
IC50
10500±n/a nM
Citation
 Yang, CWYang, YNLiang, PHChen, CMChen, WLChang, HYChao, YSLee, SJ Novel small-molecule inhibitors of transmissible gastroenteritis virus. Antimicrob Agents Chemother 51:3924-31 (2007)  
Target
Name:
Replicase polyprotein 1ab
Synonyms:
3C-like proteinase 3C-like proteinase (SARS-CoV 3Cpro) 3CLp GFL Guanine-N7 methyltransferase Helicase Leader protein Non-structural protein 10 Non-structural protein 3 Non-structural protein 6 Non-structural protein 8 ORF1ab polyprotein PL2-PRO Pol R1AB_SARS RdRp SARS coronavirus main proteinase nsp1 nsp12 nsp14 nsp16 nsp3 nsp5 nsp7 nsp9 pp1ab | rep
Type:
Protein
Mol. Mass.:
790250.81
Organism:
Human SARS coronavirus (SARS-CoV) (Severe acute respiratory syndrome coronavirus)
Description:
P0C6X7
Residue:
7073
  
Inhibitor
Name:
BDBM50480137
Synonyms:
CHEMBL518593
Type:
Small organic molecule
Emp. Form.:
C21H17N2S2
Mol. Mass.:
361.503
SMILES:
C1CC(\C=C2\CC[n+]3c2sc2ccccc32)=C2Sc3ccccc3N12
: