Target
DNA gyrase subunit A
Ligand
BDBM50117914
Substrate
Meas. Tech.
ChEMBL_607109 (CHEMBL1066707)
IC50
764000±n/a nM
Citation
 Miyauchi, RKawakami, KIto, MMatsuhashi, NOhki, HInagaki, HTakahashi, HTakemura, M Design, synthesis and biological evaluations of novel 7-[3-(1-aminocycloalkyl)pyrrolidin-1-yl]-6-desfluoro-8-methoxyquinolones with potent antibacterial activity against multi-drug resistant Gram-positive bacteria. Bioorg Med Chem 17:6879-89 (2009)  
Target
Name:
DNA gyrase subunit A
Synonyms:
DNA gyrase subunit A (gyrA) gyrA
Type:
Enzyme Subunit
Mol. Mass.:
99588.82
Organism:
Staphylococcus aureus
Description:
Residue:
889
  
Inhibitor
Name:
BDBM50117914
Synonyms:
1-Cyclopropyl-1,4-dihydro-6-fluoro-8-methoxy-7-(3-methyl-1-piperazinyl)-4-oxo-3-quinolinecarboxylic acid AM 1155 GATIFLOXACIN
Type:
Small organic molecule
Emp. Form.:
C19H22FN3O4
Mol. Mass.:
375.3941
SMILES:
COc1c(N2CCNC(C)C2)c(F)cc2c1n(cc(C(O)=O)c2=O)C1CC1
: