Target
Genome polyprotein
Ligand
BDBM50481424
Substrate
Meas. Tech.
ChEMBL_609656 (CHEMBL1067219)
IC50
64200±n/a nM
Citation
 Podvinec, MLim, SPSchmidt, TScarsi, MWen, DSonntag, LSSanschagrin, PShenkin, PSSchwede, T Novel inhibitors of dengue virus methyltransferase: discovery by in vitro-driven virtual screening on a desktop computer grid. J Med Chem 53:1483-95 (2010)  
Target
Name:
Genome polyprotein
Synonyms:
2.1.1.56 2.7.7.48 3.6.1.15 Capsid protein C Envelope protein E Flavivirin protease NS3 catalytic subunit Matrix protein NS2A NS4B Non-structural protein 2A Non-structural protein 3 Non-structural protein 4B POLG_DEN2P Peptide pr RNA-directed RNA polymerase NS5 Serine protease subunit NS2B | Small envelope protein M
Type:
PROTEIN
Mol. Mass.:
379287.38
Organism:
Dengue virus type 2
Description:
ChEMBL_109134
Residue:
3388
  
Inhibitor
Name:
BDBM50481424
Synonyms:
CHEMBL605779 | ZINC 01078518
Type:
Small organic molecule
Emp. Form.:
C23H19ClN2O4S2
Mol. Mass.:
486.991
SMILES:
Cc1ccc(Cl)cc1NS(=O)(=O)c1ccc(NS(=O)(=O)c2ccc3ccccc3c2)cc1
: